{"text_format":"1","workbook":"xlsx","n_sheets":5,"sheets":["レンタル部材発注書（第９版）","Ａ表 シート朝顔_スパン割出表","シート朝顔発注書_A表自動反映（第９版）","シート朝顔発注書_手入力分（第９版）","センター一覧表"],"not_rendered":{"charts":0,"images":1,"macros":1,"external_links":0,"defined_names":6,"comments":4,"pivot_tables":0},"unopened":[],"bounds":{"document_bytes":16777216,"sheet_cells":100000,"rows_first":2000,"rows_last":500,"rows_between":2000,"halvings":0,"cell_chars":16384,"cell_head_chars":4096},"cells_cut":0,"cells_raw":0,"read":"whole","date_system":"1900"}

{"sheet":"レンタル部材発注書（第９版）","index":0,"n_rows":63,"n_cols":12,"rows_kept":63,"cut":false,"hidden":false,"merged":[[58,0,58,1],[59,0,59,1],[60,0,60,1],[61,0,61,1],[52,0,52,1],[53,0,53,1],[54,0,54,1],[55,0,55,1],[56,0,56,1],[62,0,62,1],[62,7,62,9],[62,10,62,11],[51,0,51,1],[40,0,40,1],[41,0,41,1],[42,0,42,1],[43,0,43,1],[44,0,44,1],[45,0,45,1],[46,0,46,1],[47,0,47,1],[48,0,48,1],[49,0,49,1],[50,0,50,1],[57,0,57,1],[39,0,39,1],[28,0,28,1],[29,0,29,1],[30,0,30,1],[31,0,31,1],[32,0,32,1],[33,0,33,1],[34,0,34,1],[35,0,35,1],[36,0,36,1],[37,0,37,1],[38,0,38,1],[27,0,27,1],[16,0,16,1],[17,0,17,1],[18,0,18,1],[19,0,19,1],[20,0,20,1],[21,0,21,1],[22,0,22,1],[23,0,23,1],[24,0,24,1],[25,0,25,1],[26,0,26,1],[15,0,15,1],[8,1,8,8],[9,0,9,1],[10,0,10,1],[11,0,11,1],[12,0,12,1],[13,0,13,1],[14,0,14,1],[7,5,7,6],[7,7,7,11],[7,1,7,4],[5,8,6,8],[4,0,5,0],[4,5,4,6],[5,5,5,6],[6,5,6,6],[4,1,4,4],[5,1,5,4],[6,1,6,4],[6,10,6,11],[4,9,4,11],[0,0,2,7],[0,8,0,11],[1,8,1,11],[2,8,2,11],[3,9,3,11],[3,5,3,6],[3,1,3,4]]}
["レ　ン　タ　ル　部　材　発　注　書",null,null,null,null,null,null,null,"株式会社ASNOVA"]
[]
[null,null,null,null,null,null,null,null,{"$f":"IFERROR(\"TEL:\"&VLOOKUP($I2,センター一覧表!$B:$G,4,0)&\" FAX:\"&VLOOKUP($I2,センター一覧表!$B:$G,5,0),\"\")","v":""}]
["御社名",null,null,null,null,"担当者",null,null,"受付日"]
["現場名",null,null,null,null,"T E L",null,null,"受付者"]
[null,null,null,null,null,"納入引取日",null,null,"運　搬","御社便","　t車×","　台"]
["現場住所",null,null,null,null,"ﾚﾝﾀﾙ期間",null,"　日間",null,"当社便"," 15t　 10t　 8t　 4t"]
["元請名",null,null,null,null,"元請住所"]
[]
["品　　名",null,"品　　番","数　量","単　重","重　量",null,"品　　名","品　　番","数　量","単　重","重　量"]
["支　　柱",null,"SA-36",null,13.1,{"$f":"SUM(D11*E11)","v":0},null,"先行手摺　据置","SXⅡ-18",null,7.3,{"$f":"SUM(J11*K11)","v":0}]
["支　　柱",null,"SA-27",null,10,0,null,"先行手摺　据置","SXⅡ-15",null,6.5,0]
["支　　柱",null,"SA-18",null,6.8,0,null,"先行手摺　据置","SXⅡ-12",null,5.7,0]
["支　　柱",null,"SA-09",null,3.6,0,null,"先行手摺　据置","SXⅡ-09",null,4.9000000000000004,0]
["支　　柱",null,"SA-09頭切",null,3.6,0,null,"先行手摺　据置","SXⅡ-06",null,4.3,0]
["支　　柱",null,"SA-045",null,2.2000000000000002,0,null,"パイプジャッキ","SE-6",null,2.7,0]
["ブラケット",null,"SB-90",null,3.8,0,null,"パイプ自在ジャッキ","SE-6S",null,2.8,0]
["ブラケット",null,"SB-80",null,3.7,0,null,"壁あてジャッキ","SE-6P",null,2.2000000000000002,0]
["ブラケット",null,"SB-40",null,2.5,0,null,"ジャッキホルダー","SJH-20",null,1.1000000000000001,0]
["ブラケット",null,"SB-25",null,1.8,0,null,"アンダーベース　スチール","SPB-24S",null,0.8,0]
["張出ブラケット",null,"SBH-40",null,3.3,0,null,"アンダーベース　下屋用","SPB-600P",null,1.5,0]
["張出ブラケット",null,"SBH-25",null,2.7,0,null,"筋　　交","SLNA-18",null,4,0]
["ネットブラケット　クランプ式",null,"SNB-C",null,2,0,null,"筋　　交","SLNA-12",null,2.8,0]
["ネットブラケット　クサビ式",null,"SNB-K",null,1.8,0,null,"筋　　交","SLNA-09",null,2.6,0]
["サイドアダプター",null,"SM-120",null,0.6,0,null,"階　　段","SH-19",null,17.399999999999999,0]
["センターアダプター",null,"SDS-A1",null,0.7,0,null,"アルミ階段","SH-19AL",null,12.3,0]
["手　摺",null,"SC-18",null,4.3,0,null,"ハーフステップ","SH-19H",null,10.8,0]
["手　摺",null,"SC-15",null,3.8,0,null,"補助ステップ","SQ-N",null,3.9,0]
["手　摺",null,"SC-12",null,3,0,null,"タラップガード",null,null,10.199999999999999,0]
["手　摺",null,"SC-09",null,2.4,0,null,"先行手摺　先送式","SCS-18",null,7.9,0]
{"$rows_left_out":34}
{"sheet":"Ａ表 シート朝顔_スパン割出表","index":1,"n_rows":59,"n_cols":15,"rows_kept":59,"cut":false,"hidden":false,"merged":[[55,8,57,8],[40,2,41,2],[42,2,43,2],[44,8,45,8],[46,2,47,2],[46,8,54,8],[48,2,49,2],[50,2,51,2],[52,2,53,2],[6,12,6,13],[9,2,11,2],[12,2,14,2],[30,2,31,2],[32,2,33,2],[34,2,35,2],[3,8,4,8],[3,9,4,9],[3,10,4,10],[3,11,4,11],[5,4,5,6],[5,9,5,11],[0,0,1,2],[0,5,0,11],[0,12,0,13],[2,0,4,0],[2,2,3,2],[2,3,4,3],[3,4,4,4],[3,5,4,5],[3,6,4,6],[3,7,4,7]]}
["【次世代シート朝顔 数量割出表】\n→シート朝顔発注書へ数量反映 ",null,null,"入力部分","手順①~⑤","① 必要スパン数をサイズ別に記入 ➡ 部材数へ反映  ※OP品や調整数は必要数を部材数へ手入力",null,null,null,null,null,null,"②途切れ箇所(選択)",null,"＜途切れ箇所 説明＞"]
[null,null,null,"自動反映","　　 　サイズ\nタイプ","1800ｻｲｽﾞ","1500ｻｲｽﾞ","1200ｻｲｽﾞ","900ｻｲｽﾞ","600ｻｲｽﾞ","直線合計","コーナー","A：全周箇所","B：階層","Ａ：全周の場合(上下金具ー１)"]
["種\n類","〇"," SpeeK(スピーク)＆ASNOVA仕様","足場種類\n(どちらかの\nタイプへ\n数量記入)","くさび",null,null,null,null,null,{"$f":"SUM(F3:J3)","v":0},null,0,1,"Ｂ：階層１以上 (上下金具＋1)"]
[null,"〇",null,null,"クランプ共通\n次世代含む",null,null,null,null,null,{"$f":"SUM(F4:J5)","v":0},null,"C：直線中途切","D：ｺｰﾅｰ終始※","Ｃ：直線途中に途切れる箇所\n(上下金具＋1)"]
[null,"ー","ハピネス仕様(OP品/Wレンタル品)",null,null,null,null,null,null,null,null,null,0,0,"Ｄ：コーナー始まり・終わりの箇所(本体＋斜材＋１)"]
[null,null,null,null,"部材確認時 ↓○を選択(弊社仕様)",null,null,null,null,"部材数",null,null,"③ロープ必要可否➡","不要","※選択形式(追加)"]
["商品番号","商品番号\n(メーカー)","品名","重量","くさび\n緊結式","クランプ","次世代","基本在庫","⑤オプション\n(必要時)","必要数","④調整数\n(必要時)","合計数","備考欄",null,"発注書 オプション品\n※事前連絡必要"]
[262001,"VF-22","次世代シート朝顔　本体フレーム",4.9000000000000004,"○","○","○","◎",null,{"$f":"IF(SUM(K3:K5)=0,\"\",SUM(K3:K5)*2+N5)","v":""},null,{"$f":"IF(SUM(J8,K8)=0,\"\",SUM(J8:K8))","v":""},"共通"]
[262002,"NF-28","次世代シート朝顔　斜材",5.6,"○","○","○","◎",null,{"$f":"IF(SUM(K3:K5)=0,\"\",SUM(K3:K5)*2+N5)","v":""},null,"","共通"]
[262003,"SB-TW","次世代シート朝顔　上部金具",4.2,"○",null,null,"◎",null,{"$f":"IF(K3=0,\"\",IF(J42=\"\",K3+L3-M3+N3+M5,K3+L3-M3+N3+M5-(J42*2)))","v":""},null,"","くさび"]
[282008,"SB-TC",null,3.9,null,"○","○","◎",null,{"$f":"IF(K4=0,\"\",IF(J42=\"\",K4-L4-M3+N3+M5-J12,K4-L4-M3+N3+M5-J12-(J42*2)))","v":""},null,{"$f":"IF(SUM(J11,K11)=0,\"\",SUM(J11:K11))","v":""},"クランプ共通"]
["ー","SB-TZ",null,4.5,null,null,"ー","×","◆OP品(手入力)",null,null,{"$f":"IF(SUM(J12,K12)=0,\"\",SUM(J12:K12))","v":""},"ハピネス(次世代)"," ※OP下部金具に反映 ","※発注書右側へ反映"]
[262004,"SB-BW","次世代シート朝顔　下部金具",4.3,"○",null,null,"◎",null,{"$f":"IF(K3=0,\"\",IF(J42=\"\",K3+L3-M3+N3+M5,K3+L3-M3+N3+M5-(J42*2)))","v":""},null,"","くさび"]
[282009,"SB-BC",null,4.5999999999999996,null,"○","○","◎",null,{"$f":"IF(K4=0,\"\",IF(J42=\"\",K4-L4-M3+N3+M5-J12,K4-L4-M3+N3+M5-J12-(J42*2)))","v":""},null,"","クランプ共通"]
["ー","SB-BZ",null,4.5999999999999996,null,null,"ー","×","◆に反映",{"$f":"IF(J12=\"\",\"\",J12)","v":""},null,"","ハピネス(次世代)",null,"※発注書右側へ反映"]
[262005,"TF-18","次世代シート朝顔　上部フレーム１８００",3.9,"○","○","○","◎",null,{"$f":"IF(SUM(F3:F5)=0,\"\",SUM(F3:F5))","v":""},null,"","共通"]
[262006,"BF-18","次世代シート朝顔　下部フレーム１８００",2.6,"○","○","○","◎",null,{"$f":"IF(SUM(F3:F5)=0,\"\",SUM(F3:F5))","v":""},null,"","〃"]
[262007,"SS-18(ﾌﾞﾙｰ)","次世代シート朝顔　直線シート１８００",7.4,"○","○","○","◎",null,{"$f":"IF(SUM(F3:F5)=0,\"\",SUM(F3:F5))","v":""},null,"","〃"]
[262008,"TF-15","次世代シート朝顔　上部フレーム１５００",3.4,"○","○","○","○",null,{"$f":"IF(SUM(G3:G5)=0,\"\",SUM(G3:G5))","v":""},null,"","〃"]
[262009,"BF-15","次世代シート朝顔　下部フレーム１５００",2.1,"○","○","○","○",null,{"$f":"IF(SUM(G3:G5)=0,\"\",SUM(G3:G5))","v":""},null,"","〃"]
[262010,"SS-15(ﾌﾞﾙｰ)","次世代シート朝顔　直線シート１５００",6.4,"○","○","○","○",null,{"$f":"IF(SUM(G3:G5)=0,\"\",SUM(G3:G5))","v":""},null,"","〃"]
[262011,"TF-12","次世代シート朝顔　上部フレーム１２００",3,"○","○","○","◎",null,{"$f":"IF(SUM(H3:H5)=0,\"\",SUM(H3:H5))","v":""},null,"","〃"]
[262012,"BF-12","次世代シート朝顔　下部フレーム１２００",1.7,"○","○","○","◎",null,{"$f":"IF(SUM(H3:H5)=0,\"\",SUM(H3:H5))","v":""},null,"","〃"]
[262013,"SS-12(ﾌﾞﾙｰ)","次世代シート朝顔　直線シート１２００",5.5,"○","○","○","◎",null,{"$f":"IF(SUM(H3:H5)=0,\"\",SUM(H3:H5))","v":""},null,"","〃"]
[262014,"TF-09","次世代シート朝顔　上部フレーム９００",2.5,"○","○","○","◎",null,{"$f":"IF(SUM(I3:I5)=0,\"\",SUM(I3:I5))","v":""},null,"","〃"]
[262015,"BF-09","次世代シート朝顔　下部フレーム９００",1.2,"○","○","○","◎",null,{"$f":"IF(SUM(I3:I5)=0,\"\",SUM(I3:I5))","v":""},null,"","〃"]
[262016,"SS-09(ﾌﾞﾙｰ)","次世代シート朝顔　直線シート９００",4.4000000000000004,"○","○","○","◎",null,{"$f":"IF(SUM(I3:I5)=0,\"\",SUM(I3:I5))","v":""},null,"","〃"]
[262017,"TF-06","次世代シート朝顔　上部フレーム６００",2,"○","○","○","◎",null,{"$f":"IF(SUM(J3:J5)=0,\"\",SUM(J3:J5))","v":""},null,"","〃"]
[262018,"BF-06","次世代シート朝顔　下部フレーム６００",0.7,"○","○","○","◎",null,{"$f":"IF(SUM(J3:J5)=0,\"\",SUM(J3:J5))","v":""},null,"","〃"]
[262019,"SS-06(ﾌﾞﾙｰ)","次世代シート朝顔　直線シート６００",3.4,"○","○","○","◎",null,{"$f":"IF(SUM(J3:J5)=0,\"\",SUM(J3:J5))","v":""},null,"","〃"]
{"$rows_left_out":30}
{"sheet":"シート朝顔発注書_A表自動反映（第９版）","index":2,"n_rows":49,"n_cols":15,"rows_kept":49,"cut":false,"hidden":false,"merged":[[68,6,68,7],[69,6,69,7],[70,6,70,7],[48,1,48,6],[41,1,41,3],[42,1,42,3],[46,1,46,3],[45,5,45,6],[47,1,47,3],[44,1,44,6],[45,1,45,4],[71,6,71,7],[75,10,75,11],[12,1,12,3],[13,1,13,3],[14,1,14,3],[15,1,15,3],[16,1,16,3],[62,6,62,7],[63,6,63,7],[64,6,64,7],[65,6,65,7],[66,6,66,7],[67,6,67,7],[58,4,58,5],[59,6,59,7],[60,6,60,7],[61,6,61,7],[54,1,55,1],[54,2,54,4],[54,5,54,6],[54,9,55,9],[54,11,54,12],[55,2,55,4],[55,5,55,6],[55,11,55,12],[52,1,53,1],[52,2,52,4],[52,10,52,12],[53,2,53,4],[53,10,53,12],[49,9,49,12],[50,9,50,12],[51,9,51,12],[43,8,43,10],[43,11,43,12],[43,1,43,6],[47,8,47,10],[47,11,47,12],[26,1,26,3],[27,1,27,3],[28,1,28,3],[26,8,26,12],[32,1,32,3],[33,1,33,3],[34,1,34,3],[29,1,29,3],[30,1,30,3],[31,1,31,3],[30,8,30,12],[34,8,34,12],[38,1,38,3],[39,1,39,3],[40,1,40,3],[35,1,35,3],[36,1,36,3],[37,1,37,3],[17,1,17,3],[18,1,18,3],[19,1,19,3],[17,8,17,12],[23,1,23,3],[24,1,24,3],[25,1,25,3],[20,1,20,3],[21,1,21,3],[22,1,22,3],[11,1,11,3],[7,2,7,12],[8,2,8,12],[9,2,9,8],[9,9,9,12],[10,8,10,12],[13,8,13,12],[11,8,11,12],[7,0,9,1],[10,0,10,6],[5,2,5,5],[5,6,5,7],[5,9,6,9],[6,2,6,5],[6,6,6,7],[6,11,6,12],[0,0,2,8],[3,0,3,1],[4,0,5,1],[6,0,6,1],[0,9,0,12],[1,9,1,12],[2,9,2,12],[3,2,3,5],[3,6,3,7],[3,10,3,12],[4,2,4,5],[4,6,4,7],[4,10,4,12]]}
["レンタル部材（次世代シート朝顔）発注書　",null,null,null,null,null,null,null,null,"株式会社ASNOVA"]
[null,null,null,null,null,null,null,null,null,"宮城仙台センター"]
[null,null,null,null,null,null,null,null,null,{"$f":"IFERROR(\"TEL:\"&VLOOKUP($J2,センター一覧表!$B:$G,4,0)&\" FAX:\"&VLOOKUP($J2,センター一覧表!$B:$G,5,0),\"\")","v":"TEL:022-394-3215 FAX:022-394-3216"}]
["御社名",null,null,null,null,null,"担当者",null,null,"受付日"]
["現場名",null,null,null,null,null,"T E L",null,null,"受付者"]
[null,null,null,null,null,null,"納入引取日",null,null,"運　搬","御社便","t車×","台"]
["現場住所",null,null,null,null,null,"ﾚﾝﾀﾙ期間",null,"　日間",null,"当社便"," 15t　 10t　 8t　 4t"]
["備　考"]
[]
[null,null,null,null,null,null,null,null,null,{"$f":"IF(SUM('Ａ表 シート朝顔_スパン割出表'!L12,'Ａ表 シート朝顔_スパン割出表'!L15,'Ａ表 シート朝顔_スパン割出表'!L32,'Ａ表 シート朝顔_スパン割出表'!L34,'Ａ表 シート朝顔_スパン割出表'!L36,'Ａ表 シート朝顔_スパン割出表'!L37,'Ａ表 シート朝顔_スパン割出表'!L38,'Ａ表 シート朝顔_スパン割出表'!L39,'Ａ表 シート朝顔_スパン割出表'!L40,'Ａ表 シート朝顔_スパン割出表'!L42,'Ａ表 シート朝顔_スパン割出表'!L44,'Ａ表 シート朝顔_スパン割出表'!L48,'Ａ表 シート朝顔_スパン割出表'!L50,'Ａ表 シート朝顔_スパン割出表'!L52,'Ａ表 シート朝顔_スパン割出表'!L54)>1,\"オプション手配必要\",\"\")","v":""}]
["シート朝顔【ＳｐｅｅＫ】 基本部材 (A表 シート朝顔_割出表より反映)",null,null,null,null,null,null,null,"【ハピネス】 オプション部材 (A表 シート朝顔_割出表より反映)"]
[null,"品　　名",null,null,"数　量","単　重","重　量",null,"◆ メーカー取寄せ対応品 ◆ 事前要確認!!"]
[262001,"　次世代シート朝顔　本体フレーム",null,null,{"$f":"IF('Ａ表 シート朝顔_スパン割出表'!$L$8=\"\",\"\",'Ａ表 シート朝顔_スパン割出表'!$L$8)","v":""},4.9000000000000004,{"$f":"IF(E13=\"\",\"\",SUM(F13*E13))","v":""},null,"品　　名","メーカー\n品番","数　量","単　重","重　量"]
[262002,"　次世代シート朝顔　斜材",null,null,{"$f":"IF('Ａ表 シート朝顔_スパン割出表'!$L$9=\"\",\"\",'Ａ表 シート朝顔_スパン割出表'!$L$9)","v":""},5.6,{"$f":"IF(E14=\"\",\"\",SUM(F14*E14))","v":""},null,"＜ハピネスタイプ 次世代 足場用＞"]
[262003,"　次世代シート朝顔　上部金具",null,null,{"$f":"IF('Ａ表 シート朝顔_スパン割出表'!$L$10=\"\",\"\",'Ａ表 シート朝顔_スパン割出表'!$L$10)","v":""},4.2,"",null," シート朝顔　上部金具","SB-TZ",{"$f":"IF('Ａ表 シート朝顔_スパン割出表'!$L$12=\"\",\"\",'Ａ表 シート朝顔_スパン割出表'!$L$12)","v":""},4.5,{"$f":"IF(K15=\"\",\"\",SUM(L15*K15))","v":""}]
[262004,"　次世代シート朝顔　下部金具",null,null,{"$f":"IF('Ａ表 シート朝顔_スパン割出表'!$L$13=\"\",\"\",'Ａ表 シート朝顔_スパン割出表'!$L$13)","v":""},4.3,"",null," シート朝顔　下部金具","SB-BZ",{"$f":"IF('Ａ表 シート朝顔_スパン割出表'!$L$15=\"\",\"\",'Ａ表 シート朝顔_スパン割出表'!$L$15)","v":""},4.5999999999999996,""]
[262005,"　次世代シート朝顔　上部フレーム1800",null,null,{"$f":"IF('Ａ表 シート朝顔_スパン割出表'!$L$16=\"\",\"\",'Ａ表 シート朝顔_スパン割出表'!$L$16)","v":""},3.9,""]
[262006,"　次世代シート朝顔　下部フレーム1800",null,null,{"$f":"IF('Ａ表 シート朝顔_スパン割出表'!$L$17=\"\",\"\",'Ａ表 シート朝顔_スパン割出表'!$L$17)","v":""},2.6,"",null,"＜ハピネスタイプ コーナー用 クランプ＆次世代 足場用＞"]
[262007,"　次世代シート朝顔　直線シート1800",null,null,{"$f":"IF('Ａ表 シート朝顔_スパン割出表'!$L$18=\"\",\"\",'Ａ表 シート朝顔_スパン割出表'!$L$18)","v":""},7.4,"",null," シート朝顔　センターフレーム","VC-22",{"$f":"IF('Ａ表 シート朝顔_スパン割出表'!$L$32=\"\",\"\",'Ａ表 シート朝顔_スパン割出表'!$L$32)","v":""},5.4,""]
[262008,"　次世代シート朝顔　上部フレーム1500",null,null,{"$f":"IF('Ａ表 シート朝顔_スパン割出表'!$L$19=\"\",\"\",'Ａ表 シート朝顔_スパン割出表'!$L$19)","v":""},3.4,"",null," シート朝顔　センター斜材","NC-28",{"$f":"IF('Ａ表 シート朝顔_スパン割出表'!$L$34=\"\",\"\",'Ａ表 シート朝顔_スパン割出表'!$L$34)","v":""},5.8,""]
[262009,"　次世代シート朝顔　下部フレーム1500",null,null,{"$f":"IF('Ａ表 シート朝顔_スパン割出表'!$L$20=\"\",\"\",'Ａ表 シート朝顔_スパン割出表'!$L$20)","v":""},2.1,"",null," シート朝顔　コーナー用シート","SS-KC",{"$f":"IF('Ａ表 シート朝顔_スパン割出表'!$L$36=\"\",\"\",'Ａ表 シート朝顔_スパン割出表'!$L$36)","v":""},6.2,""]
[262010,"　次世代シート朝顔　直線シート1500",null,null,{"$f":"IF('Ａ表 シート朝顔_スパン割出表'!$L$21=\"\",\"\",'Ａ表 シート朝顔_スパン割出表'!$L$21)","v":""},6.4,"",null," シート朝顔　ｺｰﾅｰ用フレームＬ","VL-22",{"$f":"IF('Ａ表 シート朝顔_スパン割出表'!$L$37=\"\",\"\",'Ａ表 シート朝顔_スパン割出表'!$L$37)","v":""},5.0999999999999996,""]
[262011,"　次世代シート朝顔　上部フレーム1200",null,null,{"$f":"IF('Ａ表 シート朝顔_スパン割出表'!$L$22=\"\",\"\",'Ａ表 シート朝顔_スパン割出表'!$L$22)","v":""},3,"",null," シート朝顔　ｺｰﾅｰ用フレームＲ","VR-22",{"$f":"IF('Ａ表 シート朝顔_スパン割出表'!$L$38=\"\",\"\",'Ａ表 シート朝顔_スパン割出表'!$L$38)","v":""},5.0999999999999996,""]
[262012,"　次世代シート朝顔　下部フレーム1200",null,null,{"$f":"IF('Ａ表 シート朝顔_スパン割出表'!$L$23=\"\",\"\",'Ａ表 シート朝顔_スパン割出表'!$L$23)","v":""},1.7,"",null," シート朝顔　ｺｰﾅｰ用斜材Ｌ","NL-28",{"$f":"IF('Ａ表 シート朝顔_スパン割出表'!$L$39=\"\",\"\",'Ａ表 シート朝顔_スパン割出表'!$L$39)","v":""},5.6,""]
[262013,"　次世代シート朝顔　直線シート1200",null,null,{"$f":"IF('Ａ表 シート朝顔_スパン割出表'!$L$24=\"\",\"\",'Ａ表 シート朝顔_スパン割出表'!$L$24)","v":""},5.5,"",null," シート朝顔　ｺｰﾅｰ用斜材Ｒ","NR-28",{"$f":"IF('Ａ表 シート朝顔_スパン割出表'!$L$40=\"\",\"\",'Ａ表 シート朝顔_スパン割出表'!$L$40)","v":""},5.6,""]
[262014,"　次世代シート朝顔　上部フレーム900",null,null,{"$f":"IF('Ａ表 シート朝顔_スパン割出表'!$L$25=\"\",\"\",'Ａ表 シート朝顔_スパン割出表'!$L$25)","v":""},2.5,""]
[262015,"　次世代シート朝顔　下部フレーム900",null,null,{"$f":"IF('Ａ表 シート朝顔_スパン割出表'!$L$26=\"\",\"\",'Ａ表 シート朝顔_スパン割出表'!$L$26)","v":""},1.2,"",null,"＜ハピネスタイプ コーナー用 次世代 足場用＞"]
[262016,"　次世代シート朝顔　直線シート900",null,null,{"$f":"IF('Ａ表 シート朝顔_スパン割出表'!$L$27=\"\",\"\",'Ａ表 シート朝顔_スパン割出表'!$L$27)","v":""},4.4000000000000004,"",null," シート朝顔　ｺｰﾅｰ用上部金具Ｌ","KB-TZ",{"$f":"IF('Ａ表 シート朝顔_スパン割出表'!$L$42=\"\",\"\",'Ａ表 シート朝顔_スパン割出表'!$L$42)","v":""},7.8,""]
[262017,"　次世代シート朝顔　上部フレーム600",null,null,{"$f":"IF('Ａ表 シート朝顔_スパン割出表'!$L$28=\"\",\"\",'Ａ表 シート朝顔_スパン割出表'!$L$28)","v":""},2,"",null," シート朝顔　ｺｰﾅｰ用上部金具Ｒ","KB-BZ",{"$f":"IF('Ａ表 シート朝顔_スパン割出表'!$L$44=\"\",\"\",'Ａ表 シート朝顔_スパン割出表'!$L$44)","v":""},8.1999999999999993,""]
[262018,"　次世代シート朝顔　下部フレーム600",null,null,{"$f":"IF('Ａ表 シート朝顔_スパン割出表'!$L$29=\"\",\"\",'Ａ表 シート朝顔_スパン割出表'!$L$29)","v":""},0.7,""]
{"$rows_left_out":20}
{"sheet":"シート朝顔発注書_手入力分（第９版）","index":3,"n_rows":49,"n_cols":15,"rows_kept":49,"cut":false,"hidden":false,"merged":[[0,0,2,8],[0,9,0,12],[1,9,1,12],[2,9,2,12],[3,0,3,1],[3,2,3,5],[3,6,3,7],[3,10,3,12],[6,11,6,12],[7,0,9,1],[7,2,7,12],[8,2,8,12],[4,0,5,1],[4,2,4,5],[4,6,4,7],[4,10,4,12],[5,2,5,5],[5,6,5,7],[5,9,6,9],[6,0,6,1],[6,2,6,5],[6,6,6,7],[17,8,17,12],[18,1,18,3],[10,0,10,6],[10,8,10,12],[11,1,11,3],[11,8,11,12],[12,1,12,3],[13,1,13,3],[13,8,13,12],[19,1,19,3],[20,1,20,3],[21,1,21,3],[22,1,22,3],[23,1,23,3],[24,1,24,3],[14,1,14,3],[15,1,15,3],[16,1,16,3],[17,1,17,3],[30,1,30,3],[30,8,30,12],[31,1,31,3],[32,1,32,3],[33,1,33,3],[34,1,34,3],[34,8,34,12],[25,1,25,3],[26,1,26,3],[26,8,26,12],[27,1,27,3],[28,1,28,3],[29,1,29,3],[43,1,43,6],[43,8,43,10],[43,11,43,12],[44,1,44,6],[35,1,35,3],[36,1,36,3],[37,1,37,3],[38,1,38,3],[39,1,39,3],[40,1,40,3],[54,1,55,1],[54,2,54,4],[54,5,54,6],[54,9,55,9],[54,11,54,12],[55,2,55,4],[55,5,55,6],[55,11,55,12],[48,1,48,6],[49,9,49,12],[50,9,50,12],[51,9,51,12],[52,1,53,1],[52,2,52,4],[52,10,52,12],[53,2,53,4],[53,10,53,12],[70,6,70,7],[71,6,71,7],[75,10,75,11],[9,2,9,12],[64,6,64,7],[65,6,65,7],[66,6,66,7],[67,6,67,7],[68,6,68,7],[69,6,69,7],[58,4,58,5],[59,6,59,7],[60,6,60,7],[61,6,61,7],[62,6,62,7],[63,6,63,7],[45,1,45,4],[45,5,45,6],[46,1,46,3],[47,1,47,3],[47,8,47,10],[47,11,47,12],[41,1,41,3],[42,1,42,3]]}
["レンタル部材（次世代シート朝顔）発注書　",null,null,null,null,null,null,null,null,"株式会社ASNOVA"]
[null,null,null,null,null,null,null,null,null,"宮城仙台センター"]
[null,null,null,null,null,null,null,null,null,{"$f":"IFERROR(\"TEL:\"&VLOOKUP($J2,センター一覧表!$B:$G,4,0)&\" FAX:\"&VLOOKUP($J2,センター一覧表!$B:$G,5,0),\"\")","v":"TEL:022-394-3215 FAX:022-394-3216"}]
["御社名",null,null,null,null,null,"担当者",null,null,"受付日"]
["現場名",null,null,null,null,null,"T E L",null,null,"受付者"]
[null,null,null,null,null,null,"納入引取日",null,null,"運　搬","御社便","t車×","台"]
["現場住所",null,null,null,null,null,"ﾚﾝﾀﾙ期間",null,"　日間",null,"当社便"," 15t　 10t　 8t　 4t"]
["備　考"]
[]
[]
["シート朝顔【ＳｐｅｅＫ】基本部材",null,null,null,null,null,null,null,"【ハピネス】 オプション部材 "]
[null,"品　　名",null,null,"数　量","単　重","重　量",null,"◆ メーカー取寄せ対応品 ◆ 事前要確認!!"]
[262001,"　次世代シート朝顔　本体フレーム",null,null,null,4.9000000000000004,{"$f":"IF(E13=\"\",\"\",SUM(F13*E13))","v":""},null,"品　　名","メーカー\n品番","数　量","単　重","重　量"]
[262002,"　次世代シート朝顔　斜材",null,null,null,5.6,{"$f":"IF(E14=\"\",\"\",SUM(F14*E14))","v":""},null,"＜ハピネスタイプ 次世代 足場用＞"]
[262003,"　次世代シート朝顔　上部金具",null,null,null,4.2,"",null," シート朝顔　上部金具","SB-TZ",null,4.5,{"$f":"IF(K15=\"\",\"\",SUM(L15*K15))","v":""}]
[262004,"　次世代シート朝顔　下部金具",null,null,null,4.3,"",null," シート朝顔　下部金具","SB-BZ",null,4.5999999999999996,""]
[262005,"　次世代シート朝顔　上部フレーム1800",null,null,null,3.9,""]
[262006,"　次世代シート朝顔　下部フレーム1800",null,null,null,2.6,"",null,"＜ハピネスタイプ コーナー用 クランプ＆次世代 足場用＞"]
[262007,"　次世代シート朝顔　直線シート1800",null,null,null,7.4,"",null," シート朝顔　センターフレーム","VC-22",null,5.4,""]
[262008,"　次世代シート朝顔　上部フレーム1500",null,null,null,3.4,"",null," シート朝顔　センター斜材","NC-28",null,5.8,""]
[262009,"　次世代シート朝顔　下部フレーム1500",null,null,null,2.1,"",null," シート朝顔　コーナー用シート","SS-KC",null,6.2,""]
[262010,"　次世代シート朝顔　直線シート1500",null,null,null,6.4,"",null," シート朝顔　ｺｰﾅｰ用フレームＬ","VL-22",null,5.0999999999999996,""]
[262011,"　次世代シート朝顔　上部フレーム1200",null,null,null,3,"",null," シート朝顔　ｺｰﾅｰ用フレームＲ","VR-22",null,5.0999999999999996,""]
[262012,"　次世代シート朝顔　下部フレーム1200",null,null,null,1.7,"",null," シート朝顔　ｺｰﾅｰ用斜材Ｌ","NL-28",null,5.6,""]
[262013,"　次世代シート朝顔　直線シート1200",null,null,null,5.5,"",null," シート朝顔　ｺｰﾅｰ用斜材Ｒ","NR-28",null,5.6,""]
[262014,"　次世代シート朝顔　上部フレーム900",null,null,null,2.5,""]
[262015,"　次世代シート朝顔　下部フレーム900",null,null,null,1.2,"",null,"＜ハピネスタイプ コーナー用 次世代 足場用＞"]
[262016,"　次世代シート朝顔　直線シート900",null,null,null,4.4000000000000004,"",null," シート朝顔　ｺｰﾅｰ用上部金具Ｌ","KB-TZ",null,7.8,""]
[262017,"　次世代シート朝顔　上部フレーム600",null,null,null,2,"",null," シート朝顔　ｺｰﾅｰ用上部金具Ｒ","KB-BZ",null,8.1999999999999993,""]
[262018,"　次世代シート朝顔　下部フレーム600",null,null,null,0.7,""]
{"$rows_left_out":20}
{"sheet":"センター一覧表","index":4,"n_rows":34,"n_cols":7,"rows_kept":34,"cut":false,"hidden":false,"merged":[[0,3,1,3]]}
[null,null,null,"株式会社ASNOVA　各センター一覧表"]
[]
[null,"センター名","〒","住所","TEL","FAX","休業日"]
[null,"宮城仙台センター","989-3212","宮城県仙台市青葉区芋沢字横前４３－３","022-394-3215","022-394-3216","日曜日・祝日"]
[null,"埼玉東松山センター","355-0801","埼玉県比企郡滑川町土塩５１７－１","0493-57-0811","0493-57-0821","日曜日・祝日"]
[null,"千葉野田センター","278-0042","千葉県野田市吉春６９８","04-7128-9623","04-7128-9723","日曜日・祝日"]
[null,"埼玉蓮田センター","349-0131","埼玉県蓮田市大字根金１０１２－１","048-766-6000","048-766-6010","日曜日・祝日"]
[null,"千葉四街道センター","284-0001","千葉県四街道市大日今宿１８４６－４","043-310-5298","043-310-5299","日曜日・祝日"]
[null,"栃木上三川センター","329-0604","栃木県河内郡上三川町大字上郷字下川原２９９番５","0285-57-1770","0285-57-1771","土曜日・日曜日・祝日"]
[null,"埼玉ふじみ野センター","356-0051","埼玉県ふじみ野市亀久保１７３０－２","049-293-3738","049-293-3739","土曜日・日曜日・祝日"]
[null,"千葉柏センター","277-0932","千葉県柏市藤ヶ谷新田１０６－２","04-7128-5194","04-7128-5195","土曜日・日曜日・祝日"]
[null,"神奈川藤沢センター","252-0824","神奈川県藤沢市打戻２０１７","0466-47-8081","0466-47-8082","日曜日・祝日"]
[null,"神奈川相模原センター","252-0114","神奈川県相模原市緑区葉山島字奈良尾１２２７－１","042-850-1161","042-850-1162","日曜日・祝日"]
[null,"静岡富士センター","417-0803","静岡県富士市桑崎８３０－２２","0545-22-2555","0545-22-2556","土曜日・日曜日・祝日"]
[null,"愛知弥富センター","498-0042","愛知県弥富市松名３丁目２１－１","0567-68-5257","0567-68-5258","日曜日・祝日"]
[null,"愛知一宮センター","494-0007 ","愛知県一宮市小信中島字柳枯草場９６４－１","0586-64-1211","0586-64-1221","日曜日・祝日"]
[null,"愛知みよしセンター","470-0213","愛知県みよし市打越町新池浦１０－５","0561-33-1420","0561-33-1421","日曜日・祝日"]
[null,"福井鯖江センター","916-0016","福井県鯖江市神中町２丁目５０１－２６","0778-52-8591","0778-52-8592","土曜日・日曜日・祝日"]
[null,"岐阜多治見センター","507-0901","岐阜県多治見市笠原町１２４８－１３","0572-56-0237","0572-56-0238","土曜日・日曜日・祝日"]
[null,"京都京田辺センター","610-0323","京都府京田辺市水取東光明谷２－１","0774-68-0222","0774-68-0223","日曜日・祝日"]
[null,"大阪和泉センター","594-1134 ","大阪府和泉市大野町１０１８－１","0725-99-3381","0725-99-3382","日曜日・祝日"]
[null,"大阪羽曳野センター","583-0862 ","大阪府羽曳野市尺度３８８－１","072-956-5518","072-956-5508","日曜日・祝日"]
[null,"兵庫三木センター","673-0435 ","兵庫県三木市別所町高木字大山９４９番地３００","0794-88-8512","0794-88-8513","日曜日・祝日"]
[null,"岡山倉敷センター","712-8052 ","岡山県倉敷市松江４丁目１１７０－１","086-486-5366","086-486-5367","土曜日・日曜日・祝日"]
[null,"佐賀鳥栖センター","841-0046","佐賀県鳥栖市真木町１１３３－１","0942-83-1076","0942-83-1077","土曜日・日曜日・祝日"]
[null,"熊本センター","861-4225","熊本県熊本市南区城南町東阿高１０９６－１","0964-42-6721","0964-42-6722","土曜日・日曜日・祝日"]
[null,"福井敦賀工事センター","914-0812","福井県敦賀市昭和町１丁目５－１３","0770-23-6714","0770-23-6711","日曜日・祝日"]
[null,"本社","453-6126","愛知県名古屋市中村区平池町4丁目60-12　グローバルゲート26階","052-589-1848","052-589-1849","土曜日・日曜日・祝日"]
[null,"機材管理部","530-0001","大阪市北区梅田３丁目４－５　毎日新聞ビル８F","06-6451-0900","06-6451-0910","土曜日・日曜日・祝日"]
[null,"仙台営業所","982-0011","宮城県仙台市太白区長町5丁目1-20 ヤマサビル　2-東号室","022-399-9647","022-399-9695","土曜日・日曜日・祝日"]
{"$rows_left_out":4}